Library

anuncio:


Olá, amantes de robótica!

Acesse o nosso novo site: SeuRobo.com.br

Acesse nossa loja virtual também: Loja.SeuRobo.com.br

E veja os serviços que prestamos: SeuRobo.com.br/serviços


A baixo um vídeo explicando como instalar as bibliotecas.


Não tem o arduino instado, veja aqui como instalar: Instalando o arduino no Windows 8, 7 e XP
Não sabe programar? Então acesse: Como programar em Arduíno, fazer robôs e projetos diversos

Baixe aqui as bibliotecas (Libraries) que utilizei nos robôs e os projetos com arduino:
  • Biblioteca para  LCD: LiquidCrystal
  • Biblioteca para servos motores: Servo
  • Biblioteca para Sensor ultrassônico: Ultrasonic
  • Biblioteca para Infra vermelho de controle remoto: IRremote
  • Biblioteca para motores DC: AFMotor

Quer ajuda ou quer ajudar? Clique em Ajuda e veja como você pode ajudar ou ser ajudado.

29 comentários:

  1. mano eu instalei a biblioteca mas quando vo compila da erro na linha Ultrasonic ultrasonic (7,8) oque eu faç da um help vei

    ResponderExcluir
    Respostas
    1. Olá, por favor, me envie o código para analisar!

      Excluir
    2. no proprio codigo do teste do sensor hcsr04 desse site da o erro na linha
      ultrasonic ultrasonic (12,8) oque pode causar esse erro

      Excluir
    3. Cara, eu baixei ela no meu note e testei, esta tudo ok com a library.
      Acho que você não retirou ela da pasta rar ou não colocou no lugar certo.
      por favor refaça os processo novamente, veja o vídeo para de auxiliar!

      Excluir
    4. eu baixei extrai ate quando entro na IDE eu consigo importa ultrasonic.h mas da erro naquela linha e nas suas outras biblioteca funciona certinho

      Excluir
    5. Certo, então desinstale o arduino e remova as pastas com as bibliotecas,e instale novamente ele logo apos coloca a biblioteca ultrassonic

      Excluir
    6. Ta Dando o meso erro aqui ! e não sei como faço, me ajuda por favor!

      Excluir
  2. velho vlw msm cara em outros sites ninguem me ajudo como voce mas o codigo que le passei nn funciono mas decha quieto queria so resolve o problema da linha Ultrasonic ultrasonic funciono agr vlw msm

    ResponderExcluir
    Respostas
    1. por nada cara, o problema do erro era que ele não reconhecia a biblioteca... qualquer coisa e só falar!

      Excluir
  3. Eu consegui roda aquela sketch eu so tirei a biblioteca ultrasoni e coloquei de novo na pasta libraris

    ResponderExcluir
  4. Leonado, você teria a biblioteca dht para disponibilizar?
    Valeu!

    ResponderExcluir
    Respostas
    1. Olá, eu tenho esse sensor, porém ainda não testei, no próximo mês devo fazer um tutorial com ele.
      uma biblioteca oficial que encontrei foi essa: https://github.com/markruys/arduino-DHT
      abraços

      Excluir
  5. Parabéns trabalho muito bom.
    O erro da biblioteca também ocorreu comigo e foi pela biblioteca estar não sei como na pasta errada compilou aqui BLZ.

    Agora só tenho uma dúvida, na verdade duas:

    Ponte H ou SHIELD servo. Fiquei meio preocupado em queimar o arduino pois nao tenho dois servos motores e sim dois motores DC com redução. A carga pode queimar a saída? me corrija se estiver errado.

    e a segunda é vc com essa configuração energética ficou com ele ligado quanto tempo??
    só para que eu tenha uma referencia.

    Desde já agradeço a atenção e novamente muito bom o trabalho. Estou começando tambem e vi que vim no lugar certo.

    ResponderExcluir
  6. Obrigado, terá muito mais robôs e projetos!

    sim, pode queima-lo.
    Porém o código do robô não funciona com motor DC, para funcionar tem que adaptar o código para usar a ponte H.

    Diogo, tirando os testes que eu fiz que não tem como saber quando tempo eu gastei,
    eu deixei ele funcionando uns 15 min é até hoje eu não recarreguei a bateria, com todos os testes e demostração que eu fiz.

    Por nada, a intenção do site é ajudar a todos! e compartilhar o conhecimento, coisa que poucos fazem.

    Se poder divulgar os sites e assinar os canais no youtube, fico muito agradecido!
    Abraço

    ResponderExcluir
  7. Ei cara, vc teria a biblioteca do sensor biometrico pf?
    agradeco desde ja

    ResponderExcluir
    Respostas
    1. Olá. amigo.
      Veja se essa biblioteca serve: Biometria
      Abraço

      Excluir
  8. Bom dia
    preciso acionar um rele e desligar na mesma tecla com ir remot pode me ajuda, Obrigado

    ResponderExcluir
    Respostas
    1. Olá Adriano, podemos sim. é só clicar no meu contato e enviar sua duvida.

      Excluir
  9. Estou montando um robô autônomo. só falta fazer o programa que deve ser carregado no Arduino Uno funcionar.
    Quando eu vou testar o programa, antes de carregar, surge o erro:
    sketch_dec11a.ino:17:79: fatal error: AFMotor.h: No such file or directory
    compilation terminated.
    Erro compilando.
    O arquivo AFMotor.h está lá, mas, por algum motivo não está sendo encontrado.
    Alguém pode me ajudar?
    Agradeço.

    ResponderExcluir
    Respostas
    1. Olá, Karlovisky, em qual pasta você esta colocando o arquivo? ele esta dentro de uma pasta com o nome AFMotor?

      Excluir
    2. Oi, eu também estou com esse mesmo problema e queria saber o porque. Respondendo a sua pergunta a cima: ele esta dentro da pasta AFMotor

      Excluir
    3. Olá, isso pode ser por causa da versão do arduino, baixe a versão 1.0.5 no link: Arduino 1.0.5 nela essas bibliotecas funcionam melhor, ai é só desinstalar a versão atual baixa e instalar essa e colocar as bibliotecas que ira usar, sucesso!

      Excluir
    4. valeu obriga pela solução ajudou bastante ;:)

      Excluir
    5. Seu trabalho é demais esta me ajudando muito em meus projetos, muito obrigada mesmo

      Excluir
    6. Nós que agradecemos o acesso de vocês e os elogia, critica e sugestões, em breve o novo site vai estar no ar é ira ajudar muito mais pessoas!
      novamente obrigado por seu um amante de robótica!

      Excluir
  10. EStou tentando compilar um programa mas dá esse erro:
    Arduino: 1.6.12 (Windows Vista), Placa:"Arduino/Genuino Uno"

    avr-g++: error: CreateProcess: No such file or directory

    exit status 1
    Erro compilando para a placa Arduino/Genuino Uno

    ResponderExcluir
    Respostas
    1. Olá, o arduino 1.6.x apresenta um problemas estralhos em alguns usuários mesmo.
      para usar com essas bibliotecas eu te indico a baixar o arduino 1.0.6, ira funcionar normalmente em qualquer lugar.

      Excluir
  11. Olá, gostaria de uma ajuda.
    Não sou muito fã de usar bibliotecas, mas a desse site é essencial para o meu projeto.
    Deu o seguite erro:
    libraries\Ultrasonic\Ultrasonic.cpp.o: In function `Ultrasonic::Ultrasonic(int, int)':

    C:\Users\Marilha\Documents\Arduino\libraries\Ultrasonic/Ultrasonic.cpp:12: multiple definition of `Ultrasonic::Ultrasonic(int, int)'

    sketch\Ultrasonic\Ultrasonic.cpp.o:sketch\Ultrasonic/Ultrasonic.cpp:12: first defined here

    libraries\Ultrasonic\Ultrasonic.cpp.o: In function `Ultrasonic::Ultrasonic(int, int)':

    C:\Users\Marilha\Documents\Arduino\libraries\Ultrasonic/Ultrasonic.cpp:12: multiple definition of `Ultrasonic::Ultrasonic(int, int)'

    sketch\Ultrasonic\Ultrasonic.cpp.o:sketch\Ultrasonic/Ultrasonic.cpp:12: first defined here

    libraries\Ultrasonic\Ultrasonic.cpp.o: In function `Ultrasonic::Ultrasonic(int, int)':

    C:\Users\Marilha\Documents\Arduino\libraries\Ultrasonic/Ultrasonic.cpp:12: multiple definition of `Ultrasonic::Timing()'

    sketch\Ultrasonic\Ultrasonic.cpp.o:sketch\Ultrasonic/Ultrasonic.cpp:12: first defined here

    libraries\Ultrasonic\Ultrasonic.cpp.o: In function `Ultrasonic::Ultrasonic(int, int)':

    C:\Users\Marilha\Documents\Arduino\libraries\Ultrasonic/Ultrasonic.cpp:12: multiple definition of `Ultrasonic::Ranging(int)'

    sketch\Ultrasonic\Ultrasonic.cpp.o:sketch\Ultrasonic/Ultrasonic.cpp:12: first defined here

    collect2.exe: error: ld returned 1 exit status

    Segui os passos que falaram anteriormente, mas o problema persistiu...
    Preciso da programação pronta urgentemente; só falta resolver isso
    Obrigado por qualquer ajuda :)

    ResponderExcluir
    Respostas
    1. Olá, Ian, tudo bem?
      Por favor, instale o arduino 1.0.5, e apague qualquer biblioteca e baixe as do site e instale.
      Imagino que isso ira resolver seu problema.
      Obrigado pelo contato.
      Acesse o nosso novo site: SeuRobo.com.br
      Acesse nossa loja virtual também: Loja.SeuRobo.com.br
      E veja os serviços que prestamos: SeuRobo.com.br/servicos

      Excluir

O seu comentário estará aguardando aprovação.